msvc2010 mingw-w32 mingw-w64  
show dev-util/cmake
 success (2.8.12.1)

 success (2.8.12.1)

 success (2.8.12.1)

rss
show dev-util/subversion
 success (1.8.1)

 success (1.8.1)

 success (1.8.1)

rss
show dev-util/git
 success (1.8.3)

 success (1.8.3)

 success (1.8.3)

rss
show dev-util/pexports
 success (0.44)

 success (0.44)

 success (0.44)

rss
show dev-util/putty
 success (0.63)

 success (0.63)

 success (0.63)

rss
show dev-util/jom
 success (1_0_13)

 success (1_0_13)

 success (1_0_13)

rss
show dev-util/perl
 success (5.16.3)

 success (5.16.3)

 success (5.16.3)

rss
show dev-util/upx
 success (3.0.9)

 success (3.0.9)

 success (3.0.9)

rss
show dev-util/doxygen
 success (1.8.5)

 success (1.8.5)

 success (1.8.5)

rss
show dev-util/zip
 success (3.0)

 success (3.0)

 success (3.0)

rss
show dev-util/yasm
 success (1.2.0)

 success ()

 success ()

rss
show dev-util/gettext-tools
 success (0.18.1.1_1)

 success (0.18.1.1_1)

 success (0.18.1.1_1)

rss
show dev-util/pkg-config
 success ()

 success ()

 success ()

rss
show dev-util/ninja
 success (1.4.0)

 success (1.4.0)

 success (1.4.0)

rss
show dev-util/mingw-w32

 

 success (4.8.2-1)

 

rss
show dev-util/msys2

 

 success (base)

 success (base)

rss
show dev-util/msys

 

 success ()

 success ()

rss
show dev-util/mingw-w64

 

 

 success (4.8.2-1)

rss
show dev-util/uactools

 

 success (True)

 

rss
show binary/mysql-pkg
 success (5.6.14)

 success (5.6.14)

 success (5.6.14)

rss
show binary/vlc
 success (2.1.1)

 success (2.1.1)

 success (2.1.1)

rss
show binary/virtuoso
 success (6.1.7)

 success (6.1.7)

 success (6.1.7)

rss
show binary/ghostscript
 success (9.00)

 success (9.00)

 success (9.00)

rss
show binary/xerces-c-bin
 success (3.1.1)

 success ()

 success ()

rss
show binary/xsd
 success (3.3.0)

 success (3.3.0)

 success (3.3.0)

rss
show win32libs/xerces-c
 success ()

 success (3.1.1)

 success (3.1.1)

rss
show win32libs/openssl
 success (1.0.1e)

 success (1.0.1e)

 success (1.0.1e)

rss
show win32libs/ccache

 

 success (master-c9f60ad)

 success (master-c9f60ad)

rss
show win32libs/expat
 success (2.1.0)

 success (2.1.0)

 success (2.1.0)

rss
show win32libs/dbus
 success (1.6.14)

 success (1.6.14)

 success (1.6.14)

rss
show win32libs/sqlite
 success (3.8.1.0)

 success (3.8.1.0)

 success (3.8.1.0)

rss
show win32libs/automoc
 success (20130507)

 success (20130507)

 success (20130507)

rss
show win32libs/zlib
 success (1.2.8)

 success (1.2.8)

 success (1.2.8)

rss
show win32libs/libpng
 success (1.6.6)

 success (1.6.6)

 success (1.6.6)

rss
show win32libs/cyrus-sasl
 success (2.1.26)

 success (2.1.26)

 success (2.1.26)

rss
show win32libs/yajl
 success (1.0.12)

 success (1.0.12)

 success (1.0.12)

rss
show win32libs/libcurl
 success (7.32.0)

 success (7.32.0)

 success (7.32.0)

rss
show win32libs/win_iconv
 success (0.0.4)

 success (0.0.4)

 success (0.0.4)

rss
show win32libs/libxml2
 success (2.7.7)

 success (2.7.7)

 success (2.7.7)

rss
show win32libs/libxslt
 success (1.1.28)

 success (1.1.28)

 success (1.1.28)

rss
show win32libs/raptor2
 success (2.0.8)

 success (2.0.8)

 success (2.0.8)

rss
show win32libs/libbzip2
 success (1.0.6)

 success (1.0.6)

 success (1.0.6)

rss
show win32libs/pcre
 success (8.33)

 success (8.33)

 success (8.33)

rss
show win32libs/rasqal
 success (0.9.30)

 success (0.9.30)

 success (0.9.30)

rss
show win32libs/pthreads
 success (2.9.1)

 success ()

 success ()

rss
show win32libs/librdf
 success (1.0.16)

 success (1.0.16)

 success (1.0.16)

rss
show win32libs/boost-headers
 success (1.55.0)

 success (1.55.0)

 success (1.55.0)

rss
show win32libs/boost-bjam
 success (1.55.0)

 success (1.55.0)

 success (1.55.0)

rss
show win32libs/boost-thread
 success (1.55.0)

 success (1.55.0)

 success (1.55.0)

rss
show win32libs/clucene-core
 success (2.3.3.4)

 success (2.3.3.4)

 success (2.3.3.4)

rss
show win32libs/gettext
 success (0.18)

 success (0.18)

 success (0.18)

rss
show win32libs/exiv2
 success (0.22)

 success (0.22)

 success (0.22)

rss
show win32libs/aspell
 success (0.60.6.1)

 success (0.60.6.1)

 success (0.60.6.1)

rss
show win32libs/giflib
 success (5.0.5)

 success (5.0.5)

 success (5.0.5)

rss
show win32libs/jpeg
 success (9.0)

 success (9.0)

 success (9.0)

rss
show win32libs/jasper
 success (1.900.1-2)

 success (1.900.1-2)

 success (1.900.1-2)

rss
show win32libs/shared-mime-info
 success (1.1)

 success (1.1)

 success (1.1)

rss
show win32libs/libssh
 success (0.5.3)

 success (0.5.3)

 success (0.5.3)

rss
show win32libs/freetype
 success (2.5.0.1)

 success (2.5.0.1)

 success (2.5.0.1)

rss
show win32libs/tiff
 success (4.0.3)

 success (4.0.3)

 success (4.0.3)

rss
show win32libs/lcms2
 success (2.5)

 success (2.5)

 success (2.5)

rss
show win32libs/openjpeg
 success (1.5.1)

 success (1.5.1)

 success (1.5.1)

rss
show win32libs/lcms
 success (1.19)

 success (1.19)

 success (1.19)

rss
show win32libs/taglib
 success (1.8)

 success (1.8)

 success (1.8)

rss
show win32libs/boost-program-options
 success (1.55.0)

 success (1.55.0)

 success (1.55.0)

rss
show win32libs/libical
 success (0.44)

 success (0.44)

 success (0.44)

rss
show win32libs/gpg-error
 success (1.12)

 success (1.12)

 success (1.12)

rss
show win32libs/assuan2
 success (2.1.1)

 success (2.1.1)

 success (2.1.1)

rss
show win32libs/gpgme
 success (1.4.3)

 success (1.4.3)

 success (1.4.3)

rss
show win32libs/openldap
 success (2.4.36)

 success (2.4.36)

 success (2.4.36)

rss
show win32libs/boost-regex
 success (1.55.0)

 success (1.55.0)

 success (1.55.0)

rss
show win32libs/boost-graph
 success (1.55.0)

 success (1.55.0)

 success (1.55.0)

rss
show win32libs/boost-system
 success (1.55.0)

 success (1.55.0)

 success (1.55.0)

rss
show win32libs/boost-random
 success (1.55.0)

 success (1.55.0)

 success (1.55.0)

rss
show win32libs/boost
 success ()

 success ()

 success ()

rss
show win32libs/glew
 success (1.10.0)

 success (1.10.0)

 success (1.10.0)

rss
show win32libs/openbabel
 success (2.3.2)

 success (2.3.2)

 success (2.3.2)

rss
show win32libs/libnova
 success (0.13.0+svn270)

 success (0.13.0+svn270)

 success (0.13.0+svn270)

rss
show win32libs/cfitsio
 success (3.35)

 success (3.35)

 success (3.35)

rss
show win32libs/nmealib
 success (0.5.3)

 success (0.5.3)

 success (0.5.3)

rss
show win32libs/libogg
 success (1.3.1)

 success (1.3.1)

 success (1.3.1)

rss
show win32libs/libvorbis
 success (1.3.3)

 success (1.3.3)

 success (1.3.3)

rss
show win32libs/libsndfile
 success (1.0.24)

 success (1.0.24)

 success (1.0.24)

rss
show win32libs/libraw
 success (0.16.0-Beta1)

 success (0.16.0-Beta1)

 success (0.16.0-Beta1)

rss
show win32libs/djvu
 success (3.5.25.3)

 success (3.5.25.3)

 success (3.5.25.3)

rss
show win32libs/libzip
 success (0.11.1)

 success (0.11.1)

 success (0.11.1)

rss
show win32libs/ebook-tools
 success (0.2.2)

 success (0.2.2)

 success (0.2.2)

rss
show win32libs/chm
 success (0.40)

 success (0.40)

 success (0.40)

rss
show win32libs/libspectre
 success (0.2.7)

 success (0.2.7)

 success (0.2.7)

rss
show win32libs/neon
 success (0.30.0)

 success (0.30.0)

 success (0.30.0)

rss
show win32libs/libmusicbrainz
 success (5.0.1)

 success (5.0.1)

 success (5.0.1)

rss
show win32libs/mpir
 success (2.6.0)

 success (2.6.0)

 success (2.6.0)

rss
show win32libs/gcrypt
 success (1.5.3)

 success (1.5.3)

 success (1.5.3)

rss
show win32libs/libidn
 success (1.19)

 success (1.19)

 success (1.19)

rss
show win32libs/libmsn
 success (4.2.1)

 success (4.2.1)

 success (4.2.1)

rss
show win32libs/libkolabxml
 success (1.0.1)

 success (1.0.1)

 success (1.0.1)

rss
show win32libs/libopensp
 success (1.5.2)

 success (1.5.2)

 success (1.5.2)

rss
show win32libs/libofx
 success (0.9.5)

 success (0.9.5)

 success (0.9.5)

rss
show win32libs/taglib-extras
 success (1.0.1)

 success (1.0.1)

 success (1.0.1)

rss
show win32libs/libfftw
 success (3.2.2)

 success (3.2.2)

 success (3.2.2)

rss
show win32libs/libsamplerate
 success (0.1.7)

 success (0.1.7)

 success (0.1.7)

rss
show win32libs/libbfd

 

 success (2.21.1a)

 success (2.21.1a)

rss
show win32libs/gsl
 success ((detached from 709cc57)-709cc57)

 success ((detached from 709cc57)-709cc57)

 success ((detached from 709cc57)-709cc57)

rss
show win32libs/icu
 success (52rc2)

 success (52rc2)

 success (52rc2)

rss
show win32libs/vc
 success (0.7.3)

 success (0.7.3)

 success (0.7.3)

rss
show data/docbook-dtd
 success (4.2)

 success (4.2)

 success (4.2)

rss
show data/docbook-xsl
 success (1.78.1)

 success (1.78.1)

 success (1.78.1)

rss
show data/shared-desktop-ontologies
 success (0.11.0)

 success (0.11.0)

 success (0.11.0)

rss
show data/poppler-data
 success (0.4.6)

 success (0.4.6)

 success (0.4.6)

rss
show libs/qt
 success (0529dc9)

 success ('git' is not recognized as an internal or external command,)

 success (0529dc9)

rss
show kdesupport/phonon
 success (4.7.1)

 success (4.7.1)

 success (4.7.1)

rss
show kdesupport/kdewin
 success (ae1c0ac)

 success ('git' is not recognized as an internal or external command,)

 success (ae1c0ac)

rss
show kdesupport/phonon-vlc
 success (0.7.1)

 success (0.7.1)

 success (0.7.1)

rss
show kdesupport/attica
 success (0.4.2)

 success (0.4.2)

 success (0.4.2)

rss
show kdesupport/qjson
 success (0.8.1)

 success (0.8.1)

 success (0.8.1)

rss
show kdesupport/dbusmenu-qt
 success (0.9.2)

 success (0.9.2)

 success (0.9.2)

rss
show kdesupport/grantlee
 success (0.3.0)

 success (0.3.0)

 success (0.3.0)

rss
show kdesupport/qca
 success (20130212)

 success (20130212)

 success (20130212)

rss
show kdesupport/qimageblitz
 success (20130212)

 success (20130212)

 success (20130212)

rss
show kdesupport/soprano
 success (v2.9.4)

 success (v2.9.4)

 success (v2.9.4)

rss
show kdesupport/strigi
 success (77c320e)

 success ('git' is not recognized as an internal or external command,)

 success ('git' is not recognized as an internal or external command,)

rss
show kdesupport/poppler
 success (0.24.3)

 success (0.24.3)

 success (0.24.3)

rss
show kdesupport/akonadi
 success (1.10.80)

 success (1.10.80)

 success (1.10.80)

rss
show kdesupport/eigen2
 success (2.0.16)

 success (2.0.16)

 success (2.0.16)

rss
show kdesupport/liblastfm
 success (1.0.8)

 success (1.0.8)

 success (1.0.8)

rss
show kdesupport/qtscriptgenerator
 success (0.1.0)

 success (0.1.0)

 success (0.1.0)

rss
show kde/kdelibs
 success (4.12.0)

 success (4.12.0)

 success (4.12.0)

rss
show kde/kactivities
 success (4.12.0)

 success (4.12.0)

 success (4.12.0)

rss
show kde/oxygen-icons
 success (4.12.0)

 success (4.12.0)

 success (4.12.0)

rss
show kde/nepomuk-core
 success (4.12.0)

 success (4.12.0)

 success (4.12.0)

rss
show kde/kdepimlibs
 success (4.12.0)

 success (4.12.0)

 success (4.12.0)

rss
show kde/kde-runtime
 success (4.12.0)

 success (4.12.0)

 success (4.12.0)

rss
show kde/kate
 success (4.12.0)

 success (4.12.0)

 success (4.12.0)

rss
show kde/nepomuk-widgets
 success (4.12.0)

 success (4.12.0)

 success (4.12.0)

rss
show kde/kde-baseapps
 success (4.12.0)

 success (4.12.0)

 success (4.12.0)

rss
show kde/kde-workspace
 success (4.11.4)

 success (4.11.4)

 success (4.11.4)

rss
show kde/kdeartwork
 success (4.12.0)

 failed (4.12.0)

from g:/build/kde/kdeartwork-20120311/work/kdeartwork-4.12.0/kscreensaver/kdesavers/Euphoria.h:25, from g:/build/kde/kdeartwork-20120311/work/kdeartwork-4.12.0/kscreensaver/kdesavers/Euphoria.cpp:28: g:\mingw\i686-w64-mingw32\include\mmsystem.h:1364:65: error: ambiguates old declaration ''DWORD timeGetTime()'' WINMMAPI DWORD WINAPI timeGetTime(void); ^ ninja: build stopped: subcommand failed. emerge fatal error: while running make cmd: ninja emerge debug: Task: Emerge stopped after: 0:00:44.367000 emerge fatal error: running python g:\emerge\portage\kde\kdeartwork\kdeartwork-20120311.py compile

 success (4.12.0)

rss
show kde/libkdeedu
 success (4.12.0)

 success (4.12.0)

 success (4.12.0)

rss
show kde/blinken
 success (4.12.0)

 success (4.12.0)

 success (4.12.0)

rss
show kde/analitza
 success (4.12.0)

 success (4.12.0)

 success (4.12.0)

rss
show kde/cantor
 failed (4.12.0)

Generating ui_settings.h Scanning dependencies of target cantor_python2backend [ 68%] [ 68%] [ 69%] [ 69%] Building CXX object src/backends/python2/CMakeFiles/cantor_python2backend.dir/cantor_python2backend_automoc.obj Building CXX object src/backends/python2/CMakeFiles/cantor_python2backend.dir/python2keywords.obj Building CXX object src/backends/python2/CMakeFiles/cantor_python2backend.dir/python2highlighter.obj Building CXX object src/backends/python2/CMakeFiles/cantor_python2backend.dir/python2completionobject.obj cantor_python2backend_automoc.cpp python2completionobject.cpp c:\python27_x86\include\pyconfig.h(201) : error C2371: ''ssize_t'' : redefinition; different basic types F:\include\msvc\sys/types.h(53) : see declaration of ''ssize_t'' c:\python27_x86\include\pyerrors.h(315) : warning C4005: ''snprintf'' : macro redefinition F:\include\msvc\stdio.h(49) : see previous definition of ''snprintf'' python2keywords.cpp python2highlighter.cpp jom: F:\build\kde\cantor-20110621\work\msvc2010-RelWithDebInfo-4.12.0\src\backends\python2\CMakeFiles\cantor_python2backend.dir\build.make [src\backends\python2\CMakeFiles\cantor_python2backend.dir\python2completionobject.obj] Error 2 jom: F:\build\kde\cantor-20110621\work\msvc2010-RelWithDebInfo-4.12.0\CMakeFiles\Makefile2 [src\backends\python2\CMakeFiles\cantor_python2backend.dir\all] Error 2 jom: F:\build\kde\cantor-20110621\work\msvc2010-RelWithDebInfo-4.12.0\Makefile [all] Error 2 emerge fatal error: while running make cmd: jom emerge debug: Task: Emerge stopped after: 0:01:56.669000 emerge fatal error: running python f:\emerge\portage\kde\kdeedu\cantor\cantor-20110621.py compile

 success (4.12.0)

 success (4.12.0)

rss
show kde/kalgebra
 success (4.12.0)

 success (4.12.0)

 success (4.12.0)

rss
show kde/kalzium
 success (4.12.0)

 success (4.12.0)

 success (4.12.0)

rss
show kde/kanagram
 success (4.12.0)

 success (4.12.0)

 success (4.12.0)

rss
show kde/kbruch
 success (4.12.0)

 success (4.12.0)

 success (4.12.0)

rss
show kde/kgeography
 success (4.12.0)

 success (4.12.0)

 success (4.12.0)

rss
show kde/khangman
 success (4.12.0)

 success (4.12.0)

 success (4.12.0)

rss
show kde/kig
 success (4.12.0)

 success (4.12.0)

 success (4.12.0)

rss
show kde/kiten
 success (4.12.0)

 success (4.12.0)

 success (4.12.0)

rss
show kde/klettres
 success (4.12.0)

 success (4.12.0)

 success (4.12.0)

rss
show kde/kmplot
 success (4.12.0)

 success (4.12.0)

 success (4.12.0)

rss
show kde/kstars
 success (4.12.0)

 failed (4.12.0)

^ In file included from g:/build/kde/kstars-20110621/work/kstars-4.12.0/kstars/dialogs/detaildialog.cpp:48:0: g:/build/kde/kstars-20110621/work/kstars-4.12.0/kstars/skyobjects/ksmoon.h:55:18: warning: by ''virtual void KSMoon::findPhase(const KSSun*)'' [-Woverloaded-virtual] virtual void findPhase( const KSSun *Sun = 0 ); ^ ninja: build stopped: subcommand failed. emerge fatal error: while running make cmd: ninja emerge debug: Task: Emerge stopped after: 0:02:02.976000 emerge fatal error: running python g:\emerge\portage\kde\kdeedu\kstars\kstars-20110621.py compile

 failed (4.12.0)

from h:/build/kde/kstars-20110621/work/kstars-4.12.0/kstars/skyobjects/starobject.cpp:18: h:/build/kde/kstars-20110621/work/kstars-4.12.0/kstars/nan.h: At global scope: h:/build/kde/kstars-20110621/work/kstars-4.12.0/kstars/nan.h:37:23: warning: ''NaN::ld'' defined but not used [-Wunused-variable] const long double ld = std::numeric_limits::quiet_NaN(); ^ ninja: build stopped: subcommand failed. emerge fatal error: while running make cmd: ninja emerge debug: Task: Emerge stopped after: 0:00:54.803000 emerge fatal error: running python h:\emerge\portage\kde\kdeedu\kstars\kstars-20110621.py compile

rss
show kde/ktouch
 success (4.12.0)

 success (4.12.0)

 success (4.12.0)

rss
show kde/kturtle
 success (4.12.0)

 success (4.12.0)

 success (4.12.0)

rss
show kde/kwordquiz
 success (4.12.0)

 success (4.12.0)

 success (4.12.0)

rss
show kde/marble
 success (4.12.0)

 success (4.12.0)

 success (4.12.0)

rss
show kde/parley
 success (4.12.0)

 success (4.12.0)

 success (4.12.0)

rss
show kde/rocs
 success (4.12.0)

 success (4.12.0)

 success (4.12.0)

rss
show kde/pairs
 success (4.12.0)

 success (4.12.0)

 success (4.12.0)

rss
show kde/libkdegames
 success (4.12.0)

 success (4.12.0)

 success (4.12.0)

rss
show kde/bomber
 success (4.12.0)

 success (4.12.0)

 success (4.12.0)

rss
show kde/bovo
 success (4.12.0)

 success (4.12.0)

 success (4.12.0)

rss
show kde/granatier
 success (4.12.0)

 success (4.12.0)

 success (4.12.0)

rss
show kde/kapman
 success (4.12.0)

 success (4.12.0)

 success (4.12.0)

rss
show kde/katomic
 success (4.12.0)

 success (4.12.0)

 success (4.12.0)

rss
show kde/knavalbattle
 success (4.12.0)

 success (4.12.0)

 success (4.12.0)

rss
show kde/kblackbox
 success (4.12.0)

 success (4.12.0)

 success (4.12.0)

rss
show kde/kblocks
 success (4.12.0)

 success (4.12.0)

 success (4.12.0)

rss
show kde/kbounce
 success (4.12.0)

 success (4.12.0)

 success (4.12.0)

rss
show kde/kbreakout
 success (4.12.0)

 success (4.12.0)

 success (4.12.0)

rss
show kde/kdiamond
 success (4.12.0)

 success (4.12.0)

 success (4.12.0)

rss
show kde/kfourinline
 success (4.12.0)

 failed (4.12.0)

^ [44/44] Linking CXX executable bin/kfourinline.exe FAILED: cmd.exe /c cd . && g:\bin\ccache.exe g++ -D_WIN32_WINNT=0x0501 -DWINVER=0x0501 -D_WIN32_IE=0x0501 -DUNICODE -Wnon-virtual-dtor -Wno-long-long -Wundef -Wcast-align -Wchar-subscripts -Wall -W -Wpointer-arith -Wformat-security -fno-exceptions -DQT_NO_EXCEPTIONS -fno-check-new -fno-common -Woverloaded-virtual -fno-threadsafe-statics -O2 -g -DNDEBUG -DQT_NO_DEBUG -mwindows src/CMakeFiles/kfourinline.dir/kfourinline_automoc.obj src/CMakeFiles/kfourinline.dir/main.obj src/CMakeFiles/kfourinline.dir/chatdlg.obj src/CMakeFiles/kfourinline.dir/kwin4.obj src/CMakeFiles/kfourinline.dir/spritenotify.obj src/CMakeFiles/kfourinline.dir/thememanager.obj src/CMakeFiles/kfourinline.dir/displayintro.obj src/CMakeFiles/kfourinline.dir/displaygame.obj src/CMakeFiles/kfourinline.dir/kwin4view.obj src/CMakeFiles/kfourinline.dir/kwin4doc.obj src/CMakeFiles/kfourinline.dir/kwin4player.obj src/CMakeFiles/kfourinline.dir/buttonsprite.obj src/CMakeFiles/kfourinline.dir/introsprite.obj src/CMakeFiles/kfourinline.dir/piecesprite.obj src/CMakeFiles/kfourinline.dir/scoresprite.obj src/CMakeFiles/kfourinline.dir/score.obj src/CMakeFiles/kfourinline.dir/aiboard.obj src/CMakeFiles/kfourinline.dir/reflectiongraphicsscene.obj src/CMakeFiles/kfourinline.dir/kgamedebugdialog.obj src/CMakeFiles/kfourinline.dir/kgamedialog.obj src/CMakeFiles/kfourinline.dir/kgamedialogconfig.obj src/CMakeFiles/kfourinline.dir/kgameconnectdialog.obj src/CMakeFiles/kfourinline.dir/kchatdialog.obj src/CMakeFiles/kfourinline.dir/pixmapsprite.obj src/CMakeFiles/kfourinline.dir/kfontutils.obj src/CMakeFiles/kfourinline.dir/prefs.obj src/CMakeFiles/kfourinline.dir/kwin4_SRCS.obj -o bin/kfourinline.exe -Wl,--out-implib,bin\libkfourinline.dll.a -Wl,--major-image-version,0,--minor-image-version,0 -LG:\lib -Lg:\lib G:/lib/libqtmain.a g://lib/libkdeui.dll.a g://lib/libkio.dll.a g://lib/libkdnssd.dll.a g://lib/libkdegames.dll.a g://lib/libkdegamesprivate.dll.a g://lib/libkdnssd.dll.a g://lib/libkdegames.dll.a g://lib/libkio.dll.a G:/lib/libQtNetwork4.a G:/lib/libQtXml4.a g://lib/libkdeui.dll.a G:/lib/libQtSvg4.a g://lib/libkdecore.dll.a G:/lib/libQtCore4.a G:/lib/libQtDBus4.a G:/lib/libkdewin.dll.a -luser32 -lshell32 -lws2_32 -lnetapi32 -luserenv G:/lib/libQtGui4.a -lkernel32 -luser32 -lgdi32 -lwinspool -lshell32 -lole32 -loleaut32 -luuid -lcomdlg32 -ladvapi32 && cmd.exe /c cd /D G:\build\kde\kfourinline-20120911\work\mingw4-RelWithDebInfo-4.12.0\src && g:\dev-utils\bin\cmake.exe -D_filename="G:/build/kde/kfourinline-20120911/work/mingw4-RelWithDebInfo-4.12.0/bin/kfourinline.exe.bat" -D_ld_library_path="G:/build/kde/kfourinline-20120911/work/mingw4-RelWithDebInfo-4.12.0/bin/.;lib;g://lib;G:/lib" -D_executable="G:/build/kde/kfourinline-20120911/work/mingw4-RelWithDebInfo-4.12.0/bin/kfourinline.exe" -P g:/share/apps/cmake/modules/kde4_exec_via_sh.cmake src/CMakeFiles/kfourinline.dir/displayintro.obj: In function `ZN12DisplayIntro11changeThemeEv'': g:/build/kde/kfourinline-20120911/work/kfourinline-4.12.0/src/displayintro.cpp:297: undefined reference to `_imp___ZN10KFontUtils13adaptFontSizeEP17QGraphicsTextItemddddd'' src/CMakeFiles/kfourinline.dir/buttonsprite.obj: In function `ZN12ButtonSprite11changeThemeEv'': g:/build/kde/kfourinline-20120911/work/kfourinline-4.12.0/src/buttonsprite.cpp:100: undefined reference to `_imp___ZN10KFontUtils13adaptFontSizeEP17QGraphicsTextItemddddd'' collect2.exe: error: ld returned 1 exit status ninja: build stopped: subcommand failed. emerge fatal error: while running make cmd: ninja emerge debug: Task: Emerge stopped after: 0:00:45.130000 emerge fatal error: running python g:\emerge\portage\kde\kdegames\kfourinline\kfourinline-20120911.py compile

 failed (4.12.0)

^ [44/44] Linking CXX executable bin/kfourinline.exe FAILED: cmd.exe /c cd . && h:\bin\ccache.exe g++ -D_WIN32_WINNT=0x0501 -DWINVER=0x0501 -D_WIN32_IE=0x0501 -DUNICODE -Wnon-virtual-dtor -Wno-long-long -Wundef -Wcast-align -Wchar-subscripts -Wall -W -Wpointer-arith -Wformat-security -fno-exceptions -DQT_NO_EXCEPTIONS -fno-check-new -fno-common -Woverloaded-virtual -fno-threadsafe-statics -O2 -g -DNDEBUG -DQT_NO_DEBUG -mwindows src/CMakeFiles/kfourinline.dir/kfourinline_automoc.obj src/CMakeFiles/kfourinline.dir/main.obj src/CMakeFiles/kfourinline.dir/chatdlg.obj src/CMakeFiles/kfourinline.dir/kwin4.obj src/CMakeFiles/kfourinline.dir/spritenotify.obj src/CMakeFiles/kfourinline.dir/thememanager.obj src/CMakeFiles/kfourinline.dir/displayintro.obj src/CMakeFiles/kfourinline.dir/displaygame.obj src/CMakeFiles/kfourinline.dir/kwin4view.obj src/CMakeFiles/kfourinline.dir/kwin4doc.obj src/CMakeFiles/kfourinline.dir/kwin4player.obj src/CMakeFiles/kfourinline.dir/buttonsprite.obj src/CMakeFiles/kfourinline.dir/introsprite.obj src/CMakeFiles/kfourinline.dir/piecesprite.obj src/CMakeFiles/kfourinline.dir/scoresprite.obj src/CMakeFiles/kfourinline.dir/score.obj src/CMakeFiles/kfourinline.dir/aiboard.obj src/CMakeFiles/kfourinline.dir/reflectiongraphicsscene.obj src/CMakeFiles/kfourinline.dir/kgamedebugdialog.obj src/CMakeFiles/kfourinline.dir/kgamedialog.obj src/CMakeFiles/kfourinline.dir/kgamedialogconfig.obj src/CMakeFiles/kfourinline.dir/kgameconnectdialog.obj src/CMakeFiles/kfourinline.dir/kchatdialog.obj src/CMakeFiles/kfourinline.dir/pixmapsprite.obj src/CMakeFiles/kfourinline.dir/kfontutils.obj src/CMakeFiles/kfourinline.dir/prefs.obj src/CMakeFiles/kfourinline.dir/kwin4_SRCS.obj -o bin/kfourinline.exe -Wl,--out-implib,bin\libkfourinline.dll.a -Wl,--major-image-version,0,--minor-image-version,0 -LH:\lib -Lh:\lib H:/lib/libqtmain.a h://lib/libkdeui.dll.a h://lib/libkio.dll.a h://lib/libkdnssd.dll.a h://lib/libkdegames.dll.a h://lib/libkdegamesprivate.dll.a h://lib/libkdnssd.dll.a h://lib/libkdegames.dll.a h://lib/libkio.dll.a H:/lib/libQtNetwork4.a H:/lib/libQtXml4.a h://lib/libkdeui.dll.a H:/lib/libQtSvg4.a h://lib/libkdecore.dll.a H:/lib/libQtCore4.a H:/lib/libQtDBus4.a H:/lib/libkdewin.dll.a -luser32 -lshell32 -lws2_32 -lnetapi32 -luserenv H:/lib/libQtGui4.a -lkernel32 -luser32 -lgdi32 -lwinspool -lshell32 -lole32 -loleaut32 -luuid -lcomdlg32 -ladvapi32 && cmd.exe /c cd /D H:\build\kde\kfourinline-20120911\work\mingw4-RelWithDebInfo-4.12.0\src && h:\dev-utils\bin\cmake.exe -D_filename="H:/build/kde/kfourinline-20120911/work/mingw4-RelWithDebInfo-4.12.0/bin/kfourinline.exe.bat" -D_ld_library_path="H:/build/kde/kfourinline-20120911/work/mingw4-RelWithDebInfo-4.12.0/bin/.;lib;h://lib;H:/lib" -D_executable="H:/build/kde/kfourinline-20120911/work/mingw4-RelWithDebInfo-4.12.0/bin/kfourinline.exe" -P h:/share/apps/cmake/modules/kde4_exec_via_sh.cmake src/CMakeFiles/kfourinline.dir/displayintro.obj: In function `DisplayIntro::changeTheme()'': h:/build/kde/kfourinline-20120911/work/kfourinline-4.12.0/src/displayintro.cpp:297: undefined reference to `__imp__ZN10KFontUtils13adaptFontSizeEP17QGraphicsTextItemddddd'' src/CMakeFiles/kfourinline.dir/buttonsprite.obj: In function `ButtonSprite::changeTheme()'': h:/build/kde/kfourinline-20120911/work/kfourinline-4.12.0/src/buttonsprite.cpp:100: undefined reference to `__imp__ZN10KFontUtils13adaptFontSizeEP17QGraphicsTextItemddddd'' collect2.exe: error: ld returned 1 exit status ninja: build stopped: subcommand failed. emerge fatal error: while running make cmd: ninja emerge debug: Task: Emerge stopped after: 0:00:12.526000 emerge fatal error: running python h:\emerge\portage\kde\kdegames\kfourinline\kfourinline-20120911.py compile

rss
show kde/kgoldrunner
 success (4.12.0)

 success (4.12.0)

 success (4.12.0)

rss
show kde/kigo
 success (4.12.0)

 success (4.12.0)

 success (4.12.0)

rss
show kde/killbots
 success (4.12.0)

 success (4.12.0)

 success (4.12.0)

rss
show kde/kiriki
 success (4.12.0)

 success (4.12.0)

 success (4.12.0)

rss
show kde/kjumpingcube
 success (4.12.0)

 success (4.12.0)

 success (4.12.0)

rss
show kde/klickety
 success (4.12.0)

 success (4.12.0)

 success (4.12.0)

rss
show kde/klines
 success (4.12.0)

 success (4.12.0)

 success (4.12.0)

rss
show kde/libkmahjongg
 success (4.12.0)

 success (4.12.0)

 success (4.12.0)

rss
show kde/kmahjongg
 success (4.12.0)

 success (4.12.0)

 success (4.12.0)

rss
show kde/kmines
 success (4.12.0)

 success (4.12.0)

 success (4.12.0)

rss
show kde/knetwalk
 success (4.12.0)

 success (4.12.0)

 success (4.12.0)

rss
show kde/kolf
 success (4.12.0)

 success (4.12.0)

 success (4.12.0)

rss
show kde/kollision
 success (4.12.0)

 success (4.12.0)

 success (4.12.0)

rss
show kde/konquest
 success (4.12.0)

 success (4.12.0)

 success (4.12.0)

rss
show kde/kpat
 success (4.12.0)

 success (4.12.0)

 success (4.12.0)

rss
show kde/kreversi
 success (4.12.0)

 success (4.12.0)

 success (4.12.0)

rss
show kde/kshisen
 success (4.12.0)

 success (4.12.0)

 success (4.12.0)

rss
show kde/ksirk
 success (4.12.0)

 success (4.12.0)

 success (4.12.0)

rss
show kde/kspaceduel
 success (4.12.0)

 success (4.12.0)

 success (4.12.0)

rss
show kde/ksquares
 success (4.12.0)

 success (4.12.0)

 success (4.12.0)

rss
show kde/ksudoku
 success (4.12.0)

 success (4.12.0)

 success (4.12.0)

rss
show kde/ksnakeduel
 success (4.12.0)

 success (4.12.0)

 success (4.12.0)

rss
show kde/ktuberling
 success (4.12.0)

 success (4.12.0)

 success (4.12.0)

rss
show kde/kubrick
 success (4.12.0)

 success (4.12.0)

 success (4.12.0)

rss
show kde/lskat
 success (4.12.0)

 success (4.12.0)

 success (4.12.0)

rss
show kde/palapeli
 success (4.12.0)

 success (4.12.0)

 success (4.12.0)

rss
show kde/picmi
 success (4.12.0)

 success (4.12.0)

 success (4.12.0)

rss
show kde/libksane
 success (4.12.0)

 success (4.12.0)

 success (4.12.0)

rss
show kde/libkexiv2
 success (4.12.0)

 success (4.12.0)

 success (4.12.0)

rss
show kde/libkdcraw
 success (4.12.0)

 success (4.12.0)

 success (4.12.0)

rss
show kde/libkipi
 success (4.12.0)

 success (4.12.0)

 success (4.12.0)

rss
show kde/okular
 success (4.12.0)

 success (4.12.0)

 success (4.12.0)

rss
show kde/gwenview
 success (4.12.0)

 success (4.12.0)

 success (4.12.0)

rss
show kde/kolourpaint
 success (4.12.0)

 success (4.12.0)

 success (4.12.0)

rss
show kde/kruler
 success (4.12.0)

 success (4.12.0)

 success (4.12.0)

rss
show kde/ksnapshot
 success (4.12.0)

 success (4.12.0)

 success (4.12.0)

rss
show kde/svgpart
 success (4.12.0)

 success (4.12.0)

 success (4.12.0)

rss
show kde/ksaneplugin
 success (4.12.0)

 success (4.12.0)

 success (4.12.0)

rss
show kde/kdegraphics-thumbnailers
 success (4.12.0)

 success (4.12.0)

 success (4.12.0)

rss
show kde/kdegraphics-mobipocket
 success (4.12.0)

 success (4.12.0)

 success (4.12.0)

rss
show kde/kdegraphics-strigi-analyzer
 success (4.12.0)

 success (4.12.0)

 success (4.12.0)

rss
show kde/kcolorchooser
 success (4.12.0)

 success (4.12.0)

 success (4.12.0)

rss
show kde/dragon
 success (4.12.0)

 success (4.12.0)

 success (4.12.0)

rss
show kde/juk
 success (4.12.0)

 success (4.12.0)

 success (4.12.0)

rss
show kde/libkcddb
 success (4.12.0)

 success (4.12.0)

 success (4.12.0)

rss
show kde/libkcompactdisc
 success (4.12.0)

 success (4.12.0)

 success (4.12.0)

rss
show kde/mplayerthumbs
 success (4.12.0)

 success (4.12.0)

 success (4.12.0)

rss
show kde/kdenetwork-strigi-analyzers
 success (4.12.0)

 success (4.12.0)

 success (4.12.0)

rss
show kde/kdnssd
 success (4.12.0)

 success (4.12.0)

 success (4.12.0)

rss
show kde/kget
 success (4.12.0)

 success (4.12.0)

 success (4.12.0)

rss
show kde/kopete
 success (4.12.0)

 success (4.12.0)

 success (4.12.0)

rss
show kde/krdc
 success (4.12.0)

 success (4.12.0)

 success (4.12.0)

rss
show kde/kdepim-runtime
 success (4.12.0)

 success (4.12.0)

 success (4.12.0)

rss
show kde/kdepim
 failed (4.12.0)

F:\include\msvc\windows.h(50) : warning C4067: unexpected tokens following preprocessor directive - expected a newline F:\include\msvc\windows.h(50) : warning C4067: unexpected tokens following preprocessor directive - expected a newline F:\include\msvc\windows.h(50) : warning C4067: unexpected tokens following preprocessor directive - expected a newline F:\include\msvc\windows.h(50) : warning C4067: unexpected tokens following preprocessor directive - expected a newline Linking CXX shared library ..\bin\incidenceeditorsngmobile.dll Creating library ..\bin\incidenceeditorsngmobile.lib and object ..\bin\incidenceeditorsngmobile.exp groupwareuidelegate.obj : error LNK2001: unresolved external symbol "public: static struct QMetaObject const IncidenceEditorNG::IncidenceDialog::staticMetaObject" (?staticMetaObject@IncidenceDialog@IncidenceEditorNG@@2UQMetaObject@@B) groupwareuidelegate.obj : error LNK2019: unresolved external symbol "public: __thiscall IncidenceEditorNG::IncidenceDialog::IncidenceDialog(class Akonadi::IncidenceChanger *,class QWidget *,class QFlags)" (??0IncidenceDialog@IncidenceEditorNG@@QAE@PAVIncidenceChanger@Akonadi@@PAVQWidget@@V?$QFlags@W4WindowType@Qt@@@@@Z) referenced in function "public: void __thiscall IncidenceEditorNG::IncidenceDialog::`default constructor closure''(void)" (??_FIncidenceDialog@IncidenceEditorNG@@QAEXXZ) ..\bin\incidenceeditorsngmobile.dll : fatal error LNK1120: 2 unresolved externals LINK Pass 1 failed. with 1120 jom: F:\build\kde\kdepim-20080202\work\msvc2010-RelWithDebInfo-4.12.0\incidenceeditor-ng\CMakeFiles\incidenceeditorsngmobile.dir\build.make [bin\incidenceeditorsngmobile.dll] Error 2 jom: F:\build\kde\kdepim-20080202\work\msvc2010-RelWithDebInfo-4.12.0\CMakeFiles\Makefile2 [incidenceeditor-ng\CMakeFiles\incidenceeditorsngmobile.dir\all] Error 2 jom: F:\build\kde\kdepim-20080202\work\msvc2010-RelWithDebInfo-4.12.0\Makefile [all] Error 2 emerge fatal error: while running make cmd: jom emerge debug: Task: Emerge stopped after: 0:58:06.559000 emerge fatal error: running python f:\emerge\portage\kde\kdepim\kdepim-20080202.py compile

 success (4.12.0)

 success (4.12.0)

rss
show kde/kdeplasma-addons
 failed (4.12.0)

F:\include\kgenericfactory.h(159) : warning C4996: ''KGenericFactory'': was declared deprecated F:\include\kgenericfactory.h(155) : warning C4996: ''KGenericFactory'': was declared deprecated F:\include\kgenericfactory.h(170) : see reference to class template instantiation ''KGenericFactory'' being compiled F:\include\kgenericfactory.h(159) : warning C4996: ''KGenericFactory'': was declared deprecated Linking CXX shared module ..\..\bin\plasma_wallpaper_mandelbrot.dll Creating library ..\..\bin\plasma_wallpaper_mandelbrot.lib and object ..\..\bin\plasma_wallpaper_mandelbrot.exp renderthread.obj : error LNK2019: unresolved external symbol "void __cdecl with_SSE2_explicitly_enabled_if_x86::mandelbrot_render_tile(class Mandelbrot *,class MandelbrotTile const &)" (??$mandelbrot_render_tile@N@with_SSE2_explicitly_enabled_if_x86@@YAXPAVMandelbrot@@ABVMandelbrotTile@@@Z) referenced in function "public: virtual void __thiscall MandelbrotRenderThread::run(void)" (?run@MandelbrotRenderThread@@UAEXXZ) renderthread.obj : error LNK2019: unresolved external symbol "void __cdecl with_SSE2_explicitly_enabled_if_x86::mandelbrot_render_tile(class Mandelbrot *,class MandelbrotTile const &)" (??$mandelbrot_render_tile@M@with_SSE2_explicitly_enabled_if_x86@@YAXPAVMandelbrot@@ABVMandelbrotTile@@@Z) referenced in function "public: virtual void __thiscall MandelbrotRenderThread::run(void)" (?run@MandelbrotRenderThread@@UAEXXZ) ..\..\bin\plasma_wallpaper_mandelbrot.dll : fatal error LNK1120: 2 unresolved externals LINK Pass 1 failed. with 1120 jom: F:\build\kde\kdeplasma-addons-20080717\work\msvc2010-RelWithDebInfo-4.12.0\wallpapers\mandelbrot\CMakeFiles\plasma_wallpaper_mandelbrot.dir\build.make [bin\plasma_wallpaper_mandelbrot.dll] Error 2 jom: F:\build\kde\kdeplasma-addons-20080717\work\msvc2010-RelWithDebInfo-4.12.0\CMakeFiles\Makefile2 [wallpapers\mandelbrot\CMakeFiles\plasma_wallpaper_mandelbrot.dir\all] Error 2 jom: F:\build\kde\kdeplasma-addons-20080717\work\msvc2010-RelWithDebInfo-4.12.0\Makefile [all] Error 2 emerge fatal error: while running make cmd: jom emerge debug: Task: Emerge stopped after: 0:04:38.757000 emerge fatal error: running python f:\emerge\portage\kde\kdeplasma-addons\kdeplasma-addons-20080717.py compile

 failed (4.12.0)

^ [683/687] Linking CXX shared module bin/plasma_runner_events.dll [684/687] Linking CXX shared module bin/plasma_wallpaper_qml.dll FAILED: cmd.exe /c cd . && g:\bin\ccache.exe g++ -Wl,--export-all-symbols -shared -o bin/plasma_wallpaper_mandelbrot.dll -Wl,--major-image-version,0,--minor-image-version,0 wallpapers/mandelbrot/CMakeFiles/plasma_wallpaper_mandelbrot.dir/plasma_wallpaper_mandelbrot_automoc.obj wallpapers/mandelbrot/CMakeFiles/plasma_wallpaper_mandelbrot.dir/mandelbrot.obj wallpapers/mandelbrot/CMakeFiles/plasma_wallpaper_mandelbrot.dir/tile.obj wallpapers/mandelbrot/CMakeFiles/plasma_wallpaper_mandelbrot.dir/renderthread.obj wallpapers/mandelbrot/CMakeFiles/plasma_wallpaper_mandelbrot.dir/render_with_arch_defaults.obj wallpapers/mandelbrot/CMakeFiles/plasma_wallpaper_mandelbrot.dir/detectSSE2.obj wallpapers/mandelbrot/CMakeFiles/plasma_wallpaper_mandelbrot.dir/mix.obj -Lg:\lib -LG:\lib g://lib/libplasma.dll.a g://lib/libkio.dll.a g://lib/libsolid.dll.a g://lib/libkio.dll.a g://lib/libsolid.dll.a G:/lib/libQtNetwork4.a G:/lib/libQtXml4.a g://lib/libkdeui.dll.a G:/lib/libQtGui4.a G:/lib/libQtSvg4.a g://lib/libkdecore.dll.a G:/lib/libQtDBus4.a G:/lib/libQtCore4.a G:/lib/libkdewin.dll.a -luser32 -lshell32 -lws2_32 -lnetapi32 -luserenv -lkernel32 -luser32 -lgdi32 -lwinspool -lshell32 -lole32 -loleaut32 -luuid -lcomdlg32 -ladvapi32 && cd . wallpapers/mandelbrot/CMakeFiles/plasma_wallpaper_mandelbrot.dir/renderthread.obj: In function `ZN22MandelbrotRenderThread3runEv'': g:/build/kde/kdeplasma-addons-20080717/work/kdeplasma-addons-4.12.0/wallpapers/mandelbrot/renderthread.cpp:43: undefined reference to `void with_SSE2_explicitly_enabled_if_x86::mandelbrot_render_tile(Mandelbrot*, MandelbrotTile const&)'' g:/build/kde/kdeplasma-addons-20080717/work/kdeplasma-addons-4.12.0/wallpapers/mandelbrot/renderthread.cpp:46: undefined reference to `void with_SSE2_explicitly_enabled_if_x86::mandelbrot_render_tile(Mandelbrot*, MandelbrotTile const&)'' collect2.exe: error: ld returned 1 exit status ninja: build stopped: subcommand failed. emerge fatal error: while running make cmd: ninja emerge debug: Task: Emerge stopped after: 0:02:03.521000 emerge fatal error: running python g:\emerge\portage\kde\kdeplasma-addons\kdeplasma-addons-20080717.py compile

 success (4.12.0)

rss
show kde/dolphin-plugins
 success (4.12.0)

 success (4.12.0)

 success (4.12.0)

rss
show kde/kapptemplate
 success (4.12.0)

 success (4.12.0)

 success (4.12.0)

rss
show kde/kcachegrind
 success (4.12.0)

 success (4.12.0)

 success (4.12.0)

rss
show kde/kdesdk-kioslaves
 success (4.12.0)

 success (4.12.0)

 success (4.12.0)

rss
show kde/kdesdk-strigi-analyzers
 success (4.12.0)

 success (4.12.0)

 success (4.12.0)

rss
show kde/libkomparediff2
 success (4.12.0)

 success (4.12.0)

 success (4.12.0)

rss
show kde/kompare
 success (4.12.0)

 success (4.12.0)

 success (4.12.0)

rss
show kde/lokalize
 success (4.12.0)

 success (4.12.0)

 success (4.12.0)

rss
show kde/okteta
 success (4.12.0)

 success (4.12.0)

 success (4.12.0)

rss
show kde/poxml
 success (4.12.0)

 success (4.12.0)

 success (4.12.0)

rss
show kde/umbrello
 success (4.12.0)

 success (4.12.0)

 success (4.12.0)

rss
show kde/kteatime
 success (4.12.0)

 success (4.12.0)

 success (4.12.0)

rss
show kde/ktux
 success (4.12.0)

 success (4.12.0)

 success (4.12.0)

rss
show kde/ark
 success (4.12.0)

 success (4.12.0)

 success (4.12.0)

rss
show kde/filelight
 success (4.12.0)

 success (4.12.0)

 success (4.12.0)

rss
show kde/kcalc
 success (4.12.0)

 success (4.12.0)

 success (4.12.0)

rss
show kde/kcharselect
 success (4.12.0)

 success (4.12.0)

 success (4.12.0)

rss
show kde/kgpg
 success (4.12.0)

 success (4.12.0)

 success (4.12.0)

rss
show kde/ktimer
 success (4.12.0)

 success (4.12.0)

 success (4.12.0)

rss
show kde/kwallet
 success (4.12.0)

 success (4.12.0)

 success (4.12.0)

rss
show kde/sweeper
 success (4.12.0)

 success (4.12.0)

 success (4.12.0)

rss
show extragear/libktorrent
 success (1.3.1)

 failed (1.3.1)

gcry_md_algo_t md; ^ g:/include/gcrypt.h:1412:18: warning: ''gcry_md_algo_t'' is deprecated (declared at g:/include/gcrypt.h:1398) [-Wdeprecated-declarations] gcry_md_algo_t md; ^ ninja: build stopped: subcommand failed. emerge fatal error: while running make cmd: ninja emerge debug: Task: Emerge stopped after: 0:02:00.433000 emerge fatal error: running python g:\emerge\portage\extragear\libktorrent\libktorrent-20100411.py compile

 failed (1.3.1)

^ h:/build/extragear/libktorrent-20100411/work/libktorrent-1.3.1/src/diskio/tests/chunkmanagertest.cpp:135:3: error: expected '';'' before ''catch'' h:/build/extragear/libktorrent-20100411/work/libktorrent-1.3.1/src/diskio/tests/chunkmanagertest.cpp:139:2: error: expected ''}'' at end of input } ^ ninja: build stopped: subcommand failed. emerge fatal error: while running make cmd: ninja emerge debug: Task: Emerge stopped after: 0:01:14.677000 emerge fatal error: running python h:\emerge\portage\extragear\libktorrent\libktorrent-20100411.py compile

rss
show extragear/libkolab
 success (0.5.0)

 success (0.5.0)

 success (0.5.0)

rss
show extragear/libkgapi
 success (2.0.2)

 success (2.0.2)

 success (2.0.2)

rss
show extragear/libkfbapi
 success (1.0)

 success (1.0)

 success (1.0)

rss
show extragear/amarok
 failed (2.8.0)

[ T=Meta::Track ] f:\build\extragear\amarok-2.7.0\work\amarok-2.8.0\src\core\meta\Observer.cpp(37) : see reference to class template instantiation ''KSharedPtr'' being compiled with [ T=Meta::Track ] f:\include\kde\../ksharedptr.h(90) : error C2227: left of ''->ref'' must point to class/struct/union/generic type f:\include\kde\../ksharedptr.h(90) : error C2228: left of ''.deref'' must have class/struct/union f:\include\kde\../ksharedptr.h(90) : warning C4150: deletion of pointer to incomplete type ''Meta::Track''; no destructor called f:\build\extragear\amarok-2.7.0\work\amarok-2.8.0\src\core/meta/forward_declarations.h(30) : see declaration of ''Meta::Track'' jom: F:\build\extragear\amarok-2.7.0\work\msvc2010-RelWithDebInfo-2.8.0\src\core\CMakeFiles\amarokcore.dir\build.make [src\core\CMakeFiles\amarokcore.dir\meta\Observer.obj] Error 2 [ 22%] Building CXX object src/core/CMakeFiles/amarokcore.dir/meta/TrackEditor.obj TrackEditor.cpp jom: F:\build\extragear\amarok-2.7.0\work\msvc2010-RelWithDebInfo-2.8.0\CMakeFiles\Makefile2 [src\core\CMakeFiles\amarokcore.dir\all] Error 2 jom: F:\build\extragear\amarok-2.7.0\work\msvc2010-RelWithDebInfo-2.8.0\Makefile [all] Error 2 emerge fatal error: while running make cmd: jom emerge debug: Task: Emerge stopped after: 0:04:07.369000 emerge fatal error: running python f:\emerge\portage\extragear\amarok\amarok-2.7.0.py compile

 success (2.8.0)

 success (2.8.0)

rss
show extragear/kile
 success (2.1-969a363)

 success (2.1-969a363)

 success (2.1-969a363)

rss
show extragear/libalkimia
 success (4.3.2)

 success (4.3.2)

 success (4.3.2)

rss
show extragear/kmymoney
 success (4.6.4)

 success (4.6.3)

 success (4.6.3)

rss
show extragear/konversation
 success (1.5-d938500c)

 success (1.5-d938500c)

 success (1.5-d938500c)

rss
show extragear/ktorrent
 success (4.3.1)

 failed (4.3.1)

but CMake did not find one. Could not find a package configuration file provided by "KTorrent" with any of the following names: KTorrentConfig.cmake ktorrent-config.cmake Add the installation prefix of "KTorrent" to CMAKE_PREFIX_PATH or set "KTorrent_DIR" to a directory containing one of the above files. If "KTorrent" provides a separate development package or SDK, be sure it has been installed. -- Configuring incomplete, errors occurred! See also "G:/build/extragear/ktorrent-20090131/work/mingw4-RelWithDebInfo-4.3.1/CMakeFiles/CMakeOutput.log". See also "G:/build/extragear/ktorrent-20090131/work/mingw4-RelWithDebInfo-4.3.1/CMakeFiles/CMakeError.log". emerge fatal error: while running configure cmd: cmake -G "Ninja" -DCMAKE_CXX_COMPILER=g:/bin/ccache.exe -DCMAKE_CXX_COMPILER_ARG1=g++ -DCMAKE_C_COMPILER=g:/bin/ccache.exe -DCMAKE_C_COMPILER_ARG1=gcc -DCMAKE_INSTALL_PREFIX="g:/" -DCMAKE_INCLUDE_PATH="g:/include" -DCMAKE_LIBRARY_PATH="g:/lib" -DCMAKE_PREFIX_PATH="g:/" -DCMAKE_BUILD_TYPE=RelWithDebInfo "g:\build\extragear\ktorrent-20090131\work\ktorrent-4.3.1" emerge debug: Task: Emerge stopped after: 0:00:08.798000 emerge fatal error: running python g:\emerge\portage\extragear\ktorrent\ktorrent-20090131.py compile

 failed (4.3.1)

but CMake did not find one. Could not find a package configuration file provided by "KTorrent" with any of the following names: KTorrentConfig.cmake ktorrent-config.cmake Add the installation prefix of "KTorrent" to CMAKE_PREFIX_PATH or set "KTorrent_DIR" to a directory containing one of the above files. If "KTorrent" provides a separate development package or SDK, be sure it has been installed. -- Configuring incomplete, errors occurred! See also "H:/build/extragear/ktorrent-20090131/work/mingw4-RelWithDebInfo-4.3.1/CMakeFiles/CMakeOutput.log". See also "H:/build/extragear/ktorrent-20090131/work/mingw4-RelWithDebInfo-4.3.1/CMakeFiles/CMakeError.log". emerge fatal error: while running configure cmd: cmake -G "Ninja" -DCMAKE_CXX_COMPILER=h:/bin/ccache.exe -DCMAKE_CXX_COMPILER_ARG1=g++ -DCMAKE_C_COMPILER=h:/bin/ccache.exe -DCMAKE_C_COMPILER_ARG1=gcc -DCMAKE_INSTALL_PREFIX="h:/" -DCMAKE_INCLUDE_PATH="h:/include" -DCMAKE_LIBRARY_PATH="h:/lib" -DCMAKE_PREFIX_PATH="h:/" -DCMAKE_BUILD_TYPE=RelWithDebInfo "h:\build\extragear\ktorrent-20090131\work\ktorrent-4.3.1" emerge debug: Task: Emerge stopped after: 0:00:06.771000 emerge fatal error: running python h:\emerge\portage\extragear\ktorrent\ktorrent-20090131.py compile

rss
show extragear/quassel
 success (0.9.2)

 success (0.9.2)

 success (0.9.2)

rss
show extragear/skanlite
 success (1.0)

 success (1.0)

 success (1.0)

rss
show extragear/skrooge
 failed (1.8.0)

f:\build\extragear\skrooge-20111009\work\msvc2010-relwithdebinfo-1.8.0\skgbasegui\moc_skgwidgetcollectiondesignerplugin.cpp(51) : error C2491: ''SKGWidgetCollectionDesignerPlugin::staticMetaObject'' : definition of dllimport static data member not allowed f:\build\extragear\skrooge-20111009\work\msvc2010-relwithdebinfo-1.8.0\skgbasegui\moc_skgwidgetcollectiondesignerplugin.cpp(61) : warning C4273: ''SKGWidgetCollectionDesignerPlugin::metaObject'' : inconsistent dll linkage f:\build\extragear\skrooge-20111009\work\msvc2010-relwithdebinfo-1.8.0\skgbasegui\../../skrooge-1.8.0/skgbasegui/skgwidgetcollectiondesignerplugin.h(33) : see previous definition of ''metaObject'' f:\build\extragear\skrooge-20111009\work\msvc2010-relwithdebinfo-1.8.0\skgbasegui\moc_skgwidgetcollectiondesignerplugin.cpp(66) : warning C4273: ''SKGWidgetCollectionDesignerPlugin::qt_metacast'' : inconsistent dll linkage f:\build\extragear\skrooge-20111009\work\msvc2010-relwithdebinfo-1.8.0\skgbasegui\../../skrooge-1.8.0/skgbasegui/skgwidgetcollectiondesignerplugin.h(33) : see previous definition of ''qt_metacast'' f:\build\extragear\skrooge-20111009\work\msvc2010-relwithdebinfo-1.8.0\skgbasegui\moc_skgwidgetcollectiondesignerplugin.cpp(78) : warning C4273: ''SKGWidgetCollectionDesignerPlugin::qt_metacall'' : inconsistent dll linkage f:\build\extragear\skrooge-20111009\work\msvc2010-relwithdebinfo-1.8.0\skgbasegui\../../skrooge-1.8.0/skgbasegui/skgwidgetcollectiondesignerplugin.h(33) : see previous definition of ''qt_metacall'' jom: F:\build\extragear\skrooge-20111009\work\msvc2010-RelWithDebInfo-1.8.0\skgbasegui\CMakeFiles\skgbaseguidesigner.dir\build.make [skgbasegui\CMakeFiles\skgbaseguidesigner.dir\skgbaseguidesigner_automoc.cpp.obj] Error 2 skgwidgetcollectiondesignerplugin.cpp f:\build\extragear\skrooge-20111009\work\skrooge-1.8.0\skgbasegui\skgwidgetcollectiondesignerplugin.cpp(45) : warning C4273: ''SKGWidgetCollectionDesignerPlugin::SKGWidgetCollectionDesignerPlugin'' : inconsistent dll linkage f:\build\extragear\skrooge-20111009\work\skrooge-1.8.0\skgbasegui\skgwidgetcollectiondesignerplugin.h(41) : see previous definition of ''{ctor}'' f:\build\extragear\skrooge-20111009\work\skrooge-1.8.0\skgbasegui\skgwidgetcollectiondesignerplugin.cpp(67) : warning C4273: ''SKGWidgetCollectionDesignerPlugin::customWidgets'' : inconsistent dll linkage f:\build\extragear\skrooge-20111009\work\skrooge-1.8.0\skgbasegui\skgwidgetcollectiondesignerplugin.h(47) : see previous definition of ''customWidgets'' skgtabwidgetdesignerplugin.cpp skgtablewidgetdesignerplugin.cpp jom: F:\build\extragear\skrooge-20111009\work\msvc2010-RelWithDebInfo-1.8.0\CMakeFiles\Makefile2 [skgbasegui\CMakeFiles\skgbaseguidesigner.dir\all] Error 2 jom: F:\build\extragear\skrooge-20111009\work\msvc2010-RelWithDebInfo-1.8.0\Makefile [all] Error 2 emerge fatal error: while running make cmd: jom emerge debug: Task: Emerge stopped after: 0:02:23.239000 emerge fatal error: running python f:\emerge\portage\extragear\skrooge\skrooge-20111009.py compile

 failed (1.8.0)

int SKGWidgetCollectionDesignerPlugin::qt_metacall(QMetaObject::Call _c, int _id, void **_a) ^ skgbasegui/moc_skgwidgetcollectiondesignerplugin.cpp:47:28: error: definition of static data member ''SKGWidgetCollectionDesignerPlugin::staticMetaObjectExtraData'' of dllimport''d class const QMetaObjectExtraData SKGWidgetCollectionDesignerPlugin::staticMetaObjectExtraData = { ^ ninja: build stopped: subcommand failed. emerge fatal error: while running make cmd: ninja emerge debug: Task: Emerge stopped after: 0:01:26.502000 emerge fatal error: running python g:\emerge\portage\extragear\skrooge\skrooge-20111009.py compile

 failed (1.8.0)

^ h:/build/extragear/skrooge-20111009/work/skrooge-1.8.0/plugins/generic/skg_dashboard/skgdashboardpluginwidget.cpp: In member function ''void SKGDashboardPluginWidget::onMoveWidget(int)'': h:/build/extragear/skrooge-20111009/work/skrooge-1.8.0/plugins/generic/skg_dashboard/skgdashboardpluginwidget.cpp:374:47: warning: assuming signed overflow does not occur when reducing constant in comparison [-Wstrict-overflow] } else if (newPos > m_items.count() - 1) { ^ ninja: build stopped: subcommand failed. emerge fatal error: while running make cmd: ninja emerge debug: Task: Emerge stopped after: 0:00:49.530000 emerge fatal error: running python h:\emerge\portage\extragear\skrooge\skrooge-20111009.py compile

rss
show kdeapps/kate-contextmenu
 success (master-cd86f51)

 success (master-cd86f51)

 success (master-cd86f51)

rss
show kdeapps/kbibtex
 success (0.5-beta2)

 success (0.5-beta2)

 success (0.5-rc2)

rss
show kdeapps/calligra
 success (2.7.90)

 failed (2.7.90)

Generating moc_TableOfContentsConfigure.cpp Generating moc_TableOfContentsEntryModel.cpp Generating moc_TableOfContentsPreview.cpp Generating moc_TableOfContentsStyleConfigure.cpp Generating moc_ValidParentStylesProxyModel.cpp ninja: build stopped: subcommand failed. emerge fatal error: while running make cmd: ninja emerge debug: Task: Emerge stopped after: 0:42:46.032000 emerge fatal error: running python g:\emerge\portage\kdeapps\calligra\calligra-20120805.py compile

 failed (2.7.90)

Generating moc_TableOfContentsConfigure.cpp Generating moc_TableOfContentsEntryModel.cpp Generating moc_TableOfContentsPreview.cpp Generating moc_TableOfContentsStyleConfigure.cpp Generating moc_ValidParentStylesProxyModel.cpp ninja: build stopped: subcommand failed. emerge fatal error: while running make cmd: ninja emerge debug: Task: Emerge stopped after: 0:29:05.908000 emerge fatal error: running python h:\emerge\portage\kdeapps\calligra\calligra-20120805.py compile

rss